CANADA
type: Concept

CA/NRCAN/ESS/GSC/NUN
type: Concept
definition: The Canada-Nunavut Geoscience Office (C-NGO) is a co-funded and co-managed partnership between Natural Resources Canada (the Geological Survey of Canada, Earth Sciences Sector), The Department of Indian and Northern Affairs Canada, and the Government of Nunavut Department of Economic Development and Transportation. The C-NGO was established in 1999. Summary Provided by: http://www.nunavutgeoscience.ca/cngo/index_e.html
in scheme: providers