DATA PROCESSING SERVICES
type: Concept

PROXIMITY ANALYSIS SERVICES
type: Concept
definition: Given a position or geographic feature, finds all objects with a specified set of properties that are located within a user-specified distance of the position or feature.
in scheme: sciencekeywords