GRACE-FO SCA
type: Concept
change note: 2019-09-09 16:16:41.0 [sritz] update WeightedRelation (Platform-Instrument); update WeightedRelation (1.0);
change note: 2019-09-09 16:13:58.0 [sritz] insert AltLabel (id: null category: primary text: GRACE-FO Star Camera Assembly language code: en);
change note: 2019-09-09 16:15:58.0 [sritz] insert WeightedRelation (id: null related concept uuid: f75e34e2-ebe7-4a6c-8bf6-da596a36b632 relationship type: null relationship value: null generated by: null);
change note: 2019-09-09 16:14:53.0 [sritz] insert Definition (id: null text: Star Camera Assembly ** is of GRACE and CHAMP (Challenging Minisatellite Payload) heritage. The objective is the precise measurement of satellite attitude. SCA consists of three DTU (Technical University of Denmark) star camera assemblies. More Information: https://gracefo.jpl.nasa.gov/ language code: en);
change note: 2019-09-09 16:17:15.0 [sritz] update Definition (Star Camera Assembly ** is of GRACE and CHAMP (Challenging Minisatellite Payload) heritage. The objective is the precise measurement of satellite attitude. SCA consists of three DTU (Technical University of Denmark) star camera assemblies. https://gracefo.jpl.nasa.gov/ More Information: https://gracefo.jpl.nasa.gov/);
change note: 2019-09-09 16:13:17.0 [sritz] Insert Concept add broader relation (GRACE-FO SCA [cf6b8783-02c7-4aae-9c46-08468a6c61c8,369133] - Cameras [d322ae9d-bde0-448f-948d-777aef096eb6,348777]);
definition: Star Camera Assembly ** is of GRACE and CHAMP (Challenging Minisatellite Payload) heritage. The objective is the precise measurement of satellite attitude. SCA consists of three DTU (Technical University of Denmark) star camera assemblies. https://gracefo.jpl.nasa.gov/ More Information: https://gracefo.jpl.nasa.gov/
in scheme: instruments

Cameras
type: Concept