Magnetic Field/Electric Field Instruments
type: Concept

MAGVAR
type: Concept
definition: The Magnetic Variometer (MAGVAR) is an instrument that measures the angle between the magnetic and geographic (true) north at a location, expressed in degrees east or west from the direction of true north.
in scheme: instruments