Chemical Meters/Analyzers
type: Concept

IRGA
type: Concept
definition: The Infrared Gas Analyzer (IRGA)is a portable, battery-powered instrument, used to measure the carbon dioxide (CO2) concentration in air and in enclosed chambers. [Summary provided by the Coweeta Long Term Ecological Research]
in scheme: instruments