Chemical Meters/Analyzers
type: Concept

C-TAG
type: Concept
change note: 2020-04-14 08:41:37.0 [tstevens] insert AltLabel (id: null category: primary text: Comprehensive Thermal Desorption Aerosol Gas Chromatograph language code: en); insert Definition (id: null text: “Comprehensive TAG”, developed with UC Berkeley, extends the thermal desorption aerosol gas chromatograph to include volatile organic compounds (VOCs) in addition to semi-volatile vapors and particles, spanning C5 to C30 compounds. C-TAG extends the collection capability of the TAG family to include gas phase precursors that form aerosols in the atmosphere, which is one of the major sources of organic particle content. The C-TAG is built around two independent collection and gas chromatography modules coupled to a shared time-of-flight mass spectrometer (gc-HRTOF by Tofwerks). Custom miniature gas chromatographs have been developed to separate molecular species in the gas and particle channels. Each channel features a custom collection cell optimized for the two volatility ranges to be measured plus dedicated online calibration modules for full quantification. The instrument is fully automated including calibrations for continuous, unattended operation in the field. language code: en);
change note: 2020-04-14 08:40:31.0 [tstevens] Insert Concept add broader relation (C-TAG [d0a5f758-5fd9-4f04-8f2b-4dce83e7dae6,559913] - Chemical Meters/Analyzers [3d25724b-832f-4a61-b0b2-4f2ccecdba94,543779]);
definition: “Comprehensive TAG”, developed with UC Berkeley, extends the thermal desorption aerosol gas chromatograph to include volatile organic compounds (VOCs) in addition to semi-volatile vapors and particles, spanning C5 to C30 compounds. C-TAG extends the collection capability of the TAG family to include gas phase precursors that form aerosols in the atmosphere, which is one of the major sources of organic particle content. The C-TAG is built around two independent collection and gas chromatography modules coupled to a shared time-of-flight mass spectrometer (gc-HRTOF by Tofwerks). Custom miniature gas chromatographs have been developed to separate molecular species in the gas and particle channels. Each channel features a custom collection cell optimized for the two volatility ranges to be measured plus dedicated online calibration modules for full quantification. The instrument is fully automated including calibrations for continuous, unattended operation in the field.
in scheme: instruments