Current/Wind Meters
type: Concept

ANEMOMETERS
type: Concept
change note: 2021-08-04 17:46:56.0 [sritz] insert AltLabel (id: null category: primary text: ANEMOMETERS language code: en);
definition: ANEMOMETERS are instruments designed to measure either total wind speed or the speed of one or more linear components of the wind vector; classified according to the transducer employed.
in scheme: instruments