Chemical Meters/Analyzers
type: Concept

DIFFERENTIAL MOBILITY ANALYZERS
type: Concept
definition: DIFFERENTIAL MOBILITY ANALYZERS are devices used to remove from a flowing gas stream a predictable fraction of particles within a narrow size range based upon electrical mobility (the electrical velocity of the particle divided by the field strength).
in scheme: instruments