OCEAN CHEMISTRY
type: Concept

NITROUS OXIDE
type: Concept
definition: A colorless gas, made up of two atoms of univalent nitrogen and one atom of oxygen, N2O. In the ocean, it is formed as a minor product of bacterial nitrification and denitrification.
in scheme: sciencekeywords