ACADEMIC
type: Concept

UCO/LASP/EVE
type: Concept
definition: The Laboratory for Atmospheric and Space Physics located at the University of Colorado provides access to the NASA Solar Dynamics Observatory (SDO) Extreme ultraviolet Variability Experiment (EVE) data sets.
in scheme: providers