HORTICULTURAL PRODUCTS
type: Concept
definition: Measurements related to any Horticultural (flowers and ornimental shrubs and trees, gardens) product which is an article of commerce .
in scheme: sciencekeywords

PLANT COMMODITIES
type: Concept