ANIMAL COMMODITIES
type: Concept

POULTRY PRODUCTS
type: Concept
definition: Any measurment related to poultry commodities, including, but not limited to, meat, eggs, and feathers, from animals such as chickens, turkeys, ducks, geese, etc...
in scheme: sciencekeywords