J - L
type: Concept

KONVEX
type: Concept
definition: The Konza Validation Experiment (KONVEX) occured during the week of 11-18 July, 1999. The MISR team made continual sunphotometer observations during the week from its Reagan, Cimel, and MFRSR instruments. Radiance samples covering both the upwelling and downwelling hemispheres were acquired using the PARABOLA III. For more information, link to the summary report at "http://www-misr.jpl.nasa.gov/mission/valwork/val_ xreports/konza99/990713_konza_summary.html
in scheme: projects