NOAA
type: Concept

DOC/NOAA/NWS/OHD
type: Concept
definition: The Office of Hydrologic Development (OHD) enhances National Weather Service (NWS) products by: * infusing new hydrologic science * developing hydrologic techniques for operational use * managing hydrologic development by NWS field offices * providing advanced hydrologic products to meet needs identified by NWS customers Summary provided by http://www.weather.gov/oh/
in scheme: providers