USDA
type: Concept

USDA/CSREES/TAES/TAMU
type: Concept
definition: The Texas Agricultural Experiment Station conducts agricultural research to assure the highest quality food and fiber products and a sustainable environment. A key component of our mission is to foster economic viability through the State of Texas and the national agricultural industry. Website: "http://agresearch.tamu.edu/" [Summary provided by Texas A&M University.]
in scheme: providers