WYOMING
type: Concept

WY/TC/DEM
type: Concept
definition: With the launch of this website, Teton County has embraced the coming age of electronic government. Counties across the United States are moving in this direction as a way of providing better services for their citizens. This website has been designed to demystify local government. All Teton County agencies are comprehensively represented here. You can find what you need in a variety of ways: by agency name, by type of service, by type of information, by a keyword search, or by looking through related topics. The Teton County website will provide you with an up-to-date, accurate and comprehensive source of information. We hope to provide County residents and businesses the broadest possible access to government, all without having to stand in line. Summary provided by http://www.tetonwyo.org/about/
in scheme: providers