PRECIPITATION RATE
type: Concept

FROZEN PRECIPITATION
type: Concept
change note: 2020-05-20 13:48:07.0 [sritz] Insert Concept add broader relation (FROZEN PRECIPITATION [d57a7ba2-7d23-472f-8d6c-674dec4e8fa0,560177] - PRECIPITATION RATE [ac50c468-df2f-429c-8394-9d63efcc6f9d,86749]);
definition: The instantaneous frozen precipitation rate at the surface
in scheme: sciencekeywords