COMMERCIAL
type: Concept

ORTECH
type: Concept
definition: ORTECH is Canada’s leading atmospheric science consulting firm providing technology based consulting services and expertise in environmental science and engineering to government, industrial, and financial organizations. ORTECH takes pride in providing the highest quality services in technical consulting, problem solving, and evaluation with an emphasis on air quality through ORTECH Environmental and an emphasis on renewable energy through ORTECH Power. Summary Provided By: http://www.ortech.ca/html/environmental/corporate.html
in scheme: providers