G - I
type: Concept

GEOMAC
type: Concept
definition: GeoMAC is an internet-based mapping tool designed to access online maps of current fire locations throughout the United States. Using a standard web browser, users can download fire information. The team is a multi-agency group with experts from the Department of Interior's Fire Management agencies, the Bureau of Land Management, National Park Service, U.S. Fish and Wildlife Service, the Bureau of Indian Affairs, and the Department of Agriculture. Other partners include the National Interagency Fire Center, and NOAA. Private corporations include ESRI, ERDAS, Sun Microsystems, and IBM. These provide mapping software applications, computer hardware and technical help. Contact Information: Rocky Mountain Mapping Center GeoMAC Building 810 Denver, CO 80225 geomac&#64usgs.org "http://geomac.usgs.gov/geomac2002/AboutGeoMAC/index.html" [Summary provided by USGS]
in scheme: projects