Thermistors
type: Concept

THERMISTORS
type: Concept
change note: 2021-08-05 17:48:05.0 [sritz] insert AltLabel (id: null category: primary text: THERMISTORS language code: en);
definition: THERMISTORS are devices with electrical resistance that varies markedly and monotonically and that possesses a negative temperature coefficient of resistivity; commonly used in meteorology and are composed of solid semi conducting materials with resistance that decreases 4% per degree Celsius.
in scheme: instruments