Tensiometer
type: Concept
change note: 2017-06-28 07:33:46.0 [tstevens] insert AltLabel (id: null category: primary text: Tensiometer language code: en); insert Definition (id: null text: A tensiometer is an instrument used to measure the soil moisture tension in the vadose zone and are used in irrigation scheduling to help farmers and other irrigation managers to determine when to water. language code: en);
change note: 2017-06-28 07:33:10.0 [tstevens] Insert Concept add broader relation (Tensiometer [d7acd06b-31c4-4562-818a-1b89f4e4d061,309717] - Probes [def72d78-3c2f-4f46-91e7-259a0e63e2de,291495]);
definition: A tensiometer is an instrument used to measure the soil moisture tension in the vadose zone and are used in irrigation scheduling to help farmers and other irrigation managers to determine when to water.
in scheme: instruments

Probes
type: Concept