BATHYMETRY
type: Concept

COASTAL BATHYMETRY
type: Concept
change note: 2016-07-12 11:37:56.0 [gee-cee] insert Definition (id: null text: The study of underwater depth of lake or coastal ocean floors. language code: en);
change note: 2016-07-12 10:35:55.0 [gee-cee] Insert Concept add broader relation (COASTAL BATHYMETRY [d80c015f-a383-4883-8309-6aab1c39f5b6,247445] - BATHYMETRY [80d79c7e-6c64-4ada-bfcc-4093969758a5,85487]);
definition: The study of underwater depth of lake or coastal ocean floors.
in scheme: sciencekeywords