MAGNETIC FIELD
type: Concept

MAGNETIC INTENSITY
type: Concept
change note: 2013-03-11 15:13:37.0 [tbs1979] update Definition (Princeton University); update Definition (Pertaining to measurements of the strength of the Earth's magnetic field.);
change note: 2013-02-18 09:57:18.0 [tbs1979] Move Concepts add broader relation (MAGNETIC INTENSITY [d817911a-685b-4c9f-bdc7-2411b8c0a7af,63919] - MAGNETIC FIELD [204b482b-449b-42c9-a5bb-f6da42bee3a4,63915]); delete broader relation (null);
definition: Pertaining to measurements of the strength of the Earth's magnetic field.
in scheme: sciencekeywords