NOAA
type: Concept

DOC/NOAA/OAR/OER
type: Concept
change note: 2019-08-28 12:29:16.0 [tstevens] insert AltLabel (id: null category: primary text: OFFICE OF OCEAN EXPLORATION AND RESEARCH, OCEANIC & ATMOSPHERIC RESEARCH, NOAA, U.S. DEPARTMENT OF COMMERCE language code: en); insert Definition (id: null text: The NOAA Office of Ocean Exploration and Research (OER) is the only federal organization dedicated to exploring the global ocean. OER works with partners to explore the ocean to make discoveries of scientific, economic, and cultural value; support innovations in exploration tools and capabilities; and encourage the next generation of ocean explorers, scientists, and engineers to pursue careers in ocean exploration and related fields. The data and information collected during expeditions and the research we support are publicly available, giving resource managers, the academic community, and the private sector the information they need to identify, understand, and manage ocean resources for this and future generations of Americans. We are also actively working with partners to expand the national ocean exploration program. language code: en); insert Resource (id: null type: provider url: https://oceanexplorer.noaa.gov/);
change note: 2019-08-28 12:26:40.0 [tstevens] Insert Concept add broader relation (DOC/NOAA/OAR/OER [d8a28a58-9af1-4904-8d4e-3dfde493b2c4,369081] - NOAA [c9003d36-020d-4e86-995a-498945576c23,337219]);
definition: The NOAA Office of Ocean Exploration and Research (OER) is the only federal organization dedicated to exploring the global ocean. OER works with partners to explore the ocean to make discoveries of scientific, economic, and cultural value; support innovations in exploration tools and capabilities; and encourage the next generation of ocean explorers, scientists, and engineers to pursue careers in ocean exploration and related fields. The data and information collected during expeditions and the research we support are publicly available, giving resource managers, the academic community, and the private sector the information they need to identify, understand, and manage ocean resources for this and future generations of Americans. We are also actively working with partners to expand the national ocean exploration program.
in scheme: providers