USGS
type: Concept

DOI/USGS/WRD/CWSC
type: Concept
change note: 2014-03-27 13:20:45.0 [epneff] update AltLabel (Colorado Water Science Center, Water Resources Division, U.S. Geological Survey, U.S. Department of the Interior); update PrefLabel (DOI/USGS/WRD/CWSC);
definition: The USGS Colorado Water Science Center is the source for water-resource information collected and interpreted by the U.S. Geological Survey in Colorado. The U.S. Geological Survey currently operates over 200 data collection sites in Colorado for acquiring information on surface-water, groundwater, water-quality, and precipitation. Many of the sites are equipped with satellite telemetry, which provides real-time data via GOES satellites and downlinks, which enables the posting of data to the Web for public dissemination. [Summary provided by the U.S. Geological Survey.]
in scheme: providers