AMFOR
type: Concept
definition: American Forests is a world leader in planting trees for environmental restoration, a pioneer in the science and practice of urban forestry, and a primary communicator of the benefits of trees and forests.
in scheme: providers

NON-GOVERNMENT/NON-PROFIT ORGANIZATIONS
type: Concept