PRECIPITATION PROFILES
type: Concept

CLOUD WATER PATH
type: Concept
change note: 2020-05-20 13:29:41.0 [sritz] Insert Concept add broader relation (CLOUD WATER PATH [db0ff132-48ed-429b-b7e7-6a173b380421,560161] - PRECIPITATION PROFILES [d4449cf4-8d4e-4282-b84d-5098715389dd,368491]);
definition: Total cloud liquid water in the atmospheric column
in scheme: sciencekeywords