UT/AGRC
type: Concept
definition: The Utah Automated Geographic Reference Center (AGRC) provides a wide range of Geographic Information System (GIS) support to the State of Utah. AGRC strives to facilitate coordination among Utah GIS users and effective, efficient use of GIS resources. AGRC Website: "http://agrc.utah.gov/"
in scheme: providers

UTAH
type: Concept