DUNES
type: Concept

PARABOLIC DUNE
type: Concept
change note: 2013-08-20 08:57:07.0 [tbs1979] update PrefLabel (PARABOLIC DUNE); insert Definition (id: null text: U-shaped mounds of sand with convex noses trailed by elongated arms are parabolic dunes. Sometimes these dunes are called U-shaped, blowout, or hairpin dunes, and they are well known in coastal deserts. Unlike crescent shaped dunes, their crests point upwind. The elongated arms of parabolic dunes follow rather than lead because they have been fixed by vegetation, while the bulk of the sand in the dune migrates forward. language code: en);
change note: 2013-08-06 08:14:28.0 [tbs1979] Insert Concept add broader relation (PARABOLIC [db89fdd2-d911-4a75-9210-ce90db043358,105519] - DUNES [362993fc-743e-42bc-a011-459baea8f427,105509]);
definition: U-shaped mounds of sand with convex noses trailed by elongated arms are parabolic dunes. Sometimes these dunes are called U-shaped, blowout, or hairpin dunes, and they are well known in coastal deserts. Unlike crescent shaped dunes, their crests point upwind. The elongated arms of parabolic dunes follow rather than lead because they have been fixed by vegetation, while the bulk of the sand in the dune migrates forward.
in scheme: sciencekeywords