SOILS
type: Concept

SOIL RESPIRATION
type: Concept
definition: The metabolic process whereby electrons are transfered from a reduced compound (usually organic) to an inorganic acceptor molecule other than oxygen.
in scheme: sciencekeywords