M - O
type: Concept

MARMAP
type: Concept
definition: Marine Resources, Monitoring, Assessment and Prediction (MARMAP) involves the collection of uniform data for fisheries management. This information has been crucial to the ecosystems approaches later developed by the Fishery Management Council. The study involved the collection of temperature, salinity, dissolved oxygen, chlorophyll, silicate, phosphate, nitrate, and nitrite.
in scheme: projects