MULTINATIONAL ORGANIZATIONS
type: Concept

UN/POPIN
type: Concept
definition: The United Nations Population Information Network is a guide that provides users with global statistics on population, social development, sustainable development and women. Website: "http://www.un.org/popin/"
in scheme: providers