VEGETATION
type: Concept

VEGETATION SPECIES
type: Concept
change note: 2021-09-08 13:44:22.0 [tstevens] update Definition (USGS);
definition: Vegetation Species are the enumeration of different species in an area.
in scheme: sciencekeywords