CHLOROPHYLL CONCENTRATIONS
type: Concept
change note: 2018-03-07 11:06:29.0 [tstevens] update PrefLabel (CHLOROPHYLL CONCENTRATIONS ); update Definition (Refers to the amount of photosynthetic plankton, or phytoplankton, present in the ocean. Phytoplankton populations are influenced by climatic factors such as sea surface temperatures and winds.); update Definition (U.S. Global Change Research Program);
change note: 2018-03-07 08:23:40.0 [tstevens] Move Concepts delete broader relation (null); add broader relation (CHLOROPHYLL [de21632f-b614-4375-8f09-d14ab00d852b,84779] - WATER CHARACTERISTICS [f7e97dc3-1181-41b5-8b90-946eb2504110,310633]);
definition: Refers to the amount of photosynthetic plankton, or phytoplankton, present in the ocean. Phytoplankton populations are influenced by climatic factors such as sea surface temperatures and winds.
in scheme: sciencekeywords

WATER CHARACTERISTICS
type: Concept