ENVIRONMENTAL IMPACTS
type: Concept

BIOCHEMICAL RELEASE
type: Concept
change note: 2012-07-11 09:49:46.0 [tbs1979] update Definition (Centers for Disease Control and Prevention (CDC)); update Definition (Biochemical release is the discharge of a chemical substance from any number of sources that can result in human health and environmental hazards.);
definition: Biochemical release is the discharge of a chemical substance from any number of sources that can result in human health and environmental hazards.
in scheme: sciencekeywords