TROPICAL CYCLONES
type: Concept

TROPICAL STORM FREQUENCY
type: Concept
change note: 2016-07-31 21:44:35.0 [saritz] insert Definition (id: null text: Number of Tropical Storms per unit time. language code: en);
change note: 2016-07-31 17:42:22.0 [saritz] Move Concepts delete broader relation (null); add broader relation (TROPICAL STORM FREQUENCY [de9ffa22-76e3-469c-926b-2dee007702d0,247481] - TROPICAL CYCLONES [06180441-d4bb-4fed-b36a-9b3cb2cac0fe,217775]);
change note: 2016-07-31 17:39:52.0 [saritz] Insert Concept add broader relation (TROPICAL STORM FREQUENCY [de9ffa22-76e3-469c-926b-2dee007702d0,247481] - TROPICAL STORM [8ebde65d-5274-4fa2-ac53-ef5e65356988,217787]);
definition: Number of Tropical Storms per unit time.
in scheme: sciencekeywords