CLOUD PROPERTIES
type: Concept

CLOUD TOP PHASE
type: Concept
change note: 2021-03-04 08:08:46.0 [tstevens] insert Definition (id: null text: A product formed from the cloud type algorithm. There are 4 categories (consistent with NOAA and NASA cloud products): warm liquid water, super-cooled liquid water, mixed phase clouds, and ice phase clouds. language code: en);
change note: 2021-02-26 13:13:14.0 [tstevens] Insert Concept add broader relation (CLOUD TOP PHASE [deddd6c7-b840-484f-aeca-253feefb8d7d,560889] - CLOUD PROPERTIES [c9e429cb-eff0-4dd3-9eca-527e0081f65c,87441]);
definition: A product formed from the cloud type algorithm. There are 4 categories (consistent with NOAA and NASA cloud products): warm liquid water, super-cooled liquid water, mixed phase clouds, and ice phase clouds.
in scheme: sciencekeywords