SOILS
type: Concept

SOIL BIOGEOCHEMISTRY
type: Concept
change note: 2020-05-15 09:28:20.0 [tstevens] Insert Concept add broader relation (SOIL BIOGEOCHEMISTRY [df5ff39e-b49f-4517-afc0-1842a1a6fdc7,560133] - SOILS [3526afb8-0dc9-43c7-8ad4-f34f250a1e91,83537]);
definition: Biological, geological, chemical and physical processes and reactions that occur within soils.
in scheme: sciencekeywords