G - I
type: Concept

GTSPP
type: Concept
change note: 2020-11-04 13:45:16.0 [tstevens] update AltLabel (The Global Temperature and Salinity Profile Programme); update Definition (The Global Temperature and Salinity Profile Programme (GTSPP) is a cooperative international project. It seeks to develop and maintain a global ocean Temperature-Salinity resource with data that are both up-to-date and of the highest quality possible. Making global measurements of ocean temperature and salinity (T-S) quickly and easily accessible to users is the primary goal of the GTSPP. Both real-time data transmitted over the Global Telecommunications System (GTS), and delayed-mode data received by the NODC are acquired and incorporated into a continuously managed database. Countries contributing to the project are Australia, Canada, France, Germany, Japan, Russia, and the United States. Canada's Marine Environmental Data Service (MEDS) leads the project, and has the operational responsibility to gather and process the real-time data. MEDS accumulates real-time data from several sources via the GTS. They check the data for several types of errors, and remove duplicate copies of the same observation before passing the data on to NODC. The quality control procedures used in GTSPP were developed by MEDS, who also coordinated the publication of those procedures through the Intergovernmental Oceanographic Commission (IOC). The U.S. NODC performs four functions for the GTSPP: Maintains the global database of temperature and salinity data and provides online access to the data. Adds realtime data supplied by MEDS to the database. Processes delayed mode copies of data by performing the same data quality tests as MEDS, then adds data to the database. Prepares monthly data sets and transfers them by network to participants in the U.S., Australia and France, as well as to requestors. In addition to MEDS and NODC, three science centers participate in the project by independently evaluating the delayed-mode data sets for the Indian, Pacific, and Atlanti…
change note: 2013-06-02 22:59:08.0 [sgrebas] update Definition (The Global Temperature-Salinity Profile Program (GTSPP) is a cooperative international project. It seeks to develop and maintain a global ocean Temperature-Salinity resource with data that are both up-to-date and of the highest quality possible. Making global measurements of ocean temperature and salinity (T-S) quickly and easily accessible to users is the primary goal of the GTSPP. Both real-time data transmitted over the Global Telecommunications System (GTS), and delayed-mode data received by the NODC are acquired and incorporated into a continuously managed database. Countries contributing to the project are Australia, Canada, France, Germany, Japan, Russia, and the United States. Canada's Marine Environmental Data Service (MEDS) leads the project, and has the operational responsibility to gather and process the real-time data. MEDS accumulates real-time data from several sources via the GTS. They check the data for several types of errors, and remove duplicate copies of the same observation before passing the data on to NODC. The quality control procedures used in GTSPP were developed by MEDS, who also coordinated the publication of those procedures through the Intergovernmental Oceanographic Commission (IOC). The U.S. NODC performs four functions for the GTSPP: Maintains the global database of temperature and salinity data and provides online access to the data. Adds realtime data supplied by MEDS to the database. Processes delayed mode copies of data by performing the same data quality tests as MEDS, then adds data to the database. Prepares monthly data sets and transfers them by network to participants in the U.S., Australia and France, as well as to requestors. In addition to MEDS and NODC, three science centers participate in the project by independently evaluating the delayed-mode data sets for the Indian, Pacific, and Atlantic Oceans. Australia's Commonwealth Scientific, Industrial and Research Organizat…
definition: The Global Temperature and Salinity Profile Programme (GTSPP) is a cooperative international project. It seeks to develop and maintain a global ocean Temperature-Salinity resource with data that are both up-to-date and of the highest quality possible. Making global measurements of ocean temperature and salinity (T-S) quickly and easily accessible to users is the primary goal of the GTSPP. Both real-time data transmitted over the Global Telecommunications System (GTS), and delayed-mode data received by the NODC are acquired and incorporated into a continuously managed database. Countries contributing to the project are Australia, Canada, France, Germany, Japan, Russia, and the United States. Canada's Marine Environmental Data Service (MEDS) leads the project, and has the operational responsibility to gather and process the real-time data. MEDS accumulates real-time data from several sources via the GTS. They check the data for several types of errors, and remove duplicate copies of the same observation before passing the data on to NODC. The quality control procedures used in GTSPP were developed by MEDS, who also coordinated the publication of those procedures through the Intergovernmental Oceanographic Commission (IOC). The U.S. NODC performs four functions for the GTSPP: Maintains the global database of temperature and salinity data and provides online access to the data. Adds realtime data supplied by MEDS to the database. Processes delayed mode copies of data by performing the same data quality tests as MEDS, then adds data to the database. Prepares monthly data sets and transfers them by network to participants in the U.S., Australia and France, as well as to requestors. In addition to MEDS and NODC, three science centers participate in the project by independently evaluating the delayed-mode data sets for the Indian, Pacific, and Atlantic Oceans. Australia's Commonwealth Scientific, Industrial and Research Organization (CSIRO), the Scripps Institution of Ocean…
in scheme: projects