ANIMALS/INVERTEBRATES
type: Concept

GNATHOSTOMULIDS
type: Concept
change note: 2017-03-13 14:08:19.0 [mgenazzi] Definition added insert Definition (id: null text: Phylum Gnathostomulida, commonly known as jaw worms, are marine microscopic free-living worms characterized by a monocliliated epidermis and complex cuticular mouthparts language code: en);
definition: Phylum Gnathostomulida, commonly known as jaw worms, are marine microscopic free-living worms characterized by a monocliliated epidermis and complex cuticular mouthparts
in scheme: sciencekeywords