MULTINATIONAL ORGANIZATIONS
type: Concept

WDC/HIE, PALISADES
type: Concept
definition: This portal, hosted by NASA’s Socioeconomic Data and Applications Center (SEDAC), provides access to a wide range of global data, associated documentation, and visualization and analysis tools, and to the community of experts on global data.
in scheme: providers