CORAL REEFS
type: Concept

BARRIER REEF
type: Concept
change note: 2013-08-20 08:47:16.0 [tbs1979] insert Definition (id: null text: A long, narrow ridge of coral or rock parallel to and relatively near a coastline, separated from the coastline by a lagoon too deep for coral growth. language code: en);
change note: 2013-08-06 08:09:51.0 [tbs1979] Insert Concept add broader relation (BARRIER REEF [e125e285-b547-47ea-b566-5dffce2bbcbd,105491] - CORAL REEFS [c6244bfb-300f-4818-bf45-cf1a15e7e073,105487]);
definition: A long, narrow ridge of coral or rock parallel to and relatively near a coastline, separated from the coastline by a lagoon too deep for coral growth.
in scheme: sciencekeywords