Spectrometers
type: Concept

TANSO-CAI-2
type: Concept
change note: 2020-06-25 12:48:44.0 [mmorahan] insert WeightedRelation (id: null related concept uuid: 67c230f3-5587-4f74-84d1-4c24a74276e4 relationship type: null relationship value: null generated by: null);
change note: 2020-06-24 15:26:24.0 [mmorahan] Insert Concept add broader relation (TANSO-CAI-2 [e1d8d749-9818-4ddf-8f61-14ef63b6ce7b,560480] - Spectrometers [055a79c7-61db-4250-abad-f1e09909f14c,543071]);
change note: 2020-06-25 12:51:09.0 [mmorahan] insert Definition (id: null text: TANSO-CAI-2 is a push-broom imaging sensor that has forward- and backward-looking bands (+-20 degrees) for observing the optical properties of aerosols and clouds, and for monitoring the status of urban air pollution and trans-boundary air pollution over oceans. An important role of CAI-2 is to perform cloud discrimination in each direction. language code: en);
definition: TANSO-CAI-2 is a push-broom imaging sensor that has forward- and backward-looking bands (+-20 degrees) for observing the optical properties of aerosols and clouds, and for monitoring the status of urban air pollution and trans-boundary air pollution over oceans. An important role of CAI-2 is to perform cloud discrimination in each direction.
in scheme: instruments