DOI
type: Concept

DOI/USFWS/FWMHR
type: Concept
definition: The Division of Fish and Wildlife Management and Habitat Restoration is part of the U.S. Fish and Wildlife Service Fisheries and Habitat Conservation Program, which mission is to provide leadership in sustaining and enhancing fish, wildlife, and their habitats for the benefit of the American people and to engage citizens in the shared stewardship of our Nation's natural resources. The Division is made up of two branches: (1) Branch of Fish and Wildlife Management Assistance; (2) Branch of Habitat Restoration. For a list of programs, see http://www.fws.gov/fisheries/Programs.htm [Source: "http://www.fws.gov/fisheries/"]
in scheme: providers