A - C
type: Concept

ANTLER
type: Concept
definition: Short Title: ANTLER Proposal URL: http://classic.ipy.org/development/eoi/proposal-details.php?id=400 ANTLER will provide a basis for research on the social significance of Rangifer (reindeer husbandry and caribou hunting). ANTLER is a research-network initiative with the aim to provide support, methodological integration, data management, and education and outreach facilities for participating projects. These projects share the same topic yet they may employ different methodologies. In addition to the existing scholarship on human-Rangifer relations, IPY 2007-2008 will foster new social-science case studies in many circumpolar regions where reindeer herding and/or caribou hunting take place. ANTLER seeks to unite these efforts, with the aim to assess the current social, socio-economic and cultural significance of reindeer herding and caribou hunting 'on the ground' and to provide reliable and realistic information for future management strategies. ANTLER participants will also compare and evaluate various methodologies in the field of Rangifer research and strategies for improved data management. ANTLER will contribute to a better understanding of an important human-animal relationship in the Arctic: on the one hand, through contributing knowledge concerning the social significance of Rangifer as it shapes human life in the Arctic; on the other hand, through examining the significance of human social, economic and political strategies as they affect Rangifer populations, distribution and its position in the Arctic ecosystem. ANTLER addresses reindeer herding and caribou hunting as important elements in Arctic and sub-Arctic environments and economies. The International Polar Year provides a timely and excellent framework for this international initiative, which will also serve as basis for enhanced multidisciplinary research on Rangifer. Within the wider field of research on human-Rangifer systems, ANTLER's main emphasis is on domesticated reindeer and the domain of…
in scheme: projects