Photon/Optical Detectors
type: Concept

HELIOGRAPHS
type: Concept
definition: HELIOGRAPHS are instruments that records the duration of sunshine and gives a qualitative measure of the amount of sunshine by the action of the sun?s rays upon blueprint paper; a type of sunshine recorder.
in scheme: instruments