ANIMALS/INVERTEBRATES
type: Concept

HORSEHAIR WORMS
type: Concept
change note: 2017-03-13 14:10:21.0 [mgenazzi] Definition added insert Definition (id: null text: Phylum Nematomorpha, commonly known as horsehair worms, are parasitoid animals on arthropods. They have cilia on an external cuticle, and only have longitudinal muscle, a nerve ring near the anterior, and non-functional gut with no respiratory, excretory or circulatory system. language code: en);
definition: Phylum Nematomorpha, commonly known as horsehair worms, are parasitoid animals on arthropods. They have cilia on an external cuticle, and only have longitudinal muscle, a nerve ring near the anterior, and non-functional gut with no respiratory, excretory or circulatory system.
in scheme: sciencekeywords