MONOCOTS
type: Concept

SEAGRASS
type: Concept
change note: 2017-03-15 11:19:42.0 [mgenazzi] Definition added insert Definition (id: null text: Seagrasses are marin angiosperms with erect, elongated leaves where photosynthesis is restricted to, and a buried rhizome system language code: en);
definition: Seagrasses are marin angiosperms with erect, elongated leaves where photosynthesis is restricted to, and a buried rhizome system
in scheme: sciencekeywords