AMS
type: Concept
change note: 2018-02-07 15:07:41.0 [sritz] update AltLabel (AEROSOL MASS SPECTROMETER);
change note: 2018-01-26 11:36:50.0 [sritz] update Definition (Aerosol Mass Spectrometer (AMS) is an instrument used for measuring aerosol composition and size.);
change note: 2018-01-26 11:34:47.0 [sritz] update AltLabel (ACCELERATOR MASS SPECTROMETER);
definition: Aerosol Mass Spectrometer (AMS) is an instrument used for measuring aerosol composition and size.
in scheme: instruments

Spectrometers/Radiometers
type: Concept