MODELS
type: Concept

REGULATORY MODELS
type: Concept
definition: Models that provide predictions and analysis of environmental factors such as air quality and water quality; also included are dispersion modeling. These models are generally associated with the U.S. EPA to support policy and regulatory decisions.
in scheme: sciencekeywords